{"text_format":"1","workbook":"xlsx","n_sheets":8,"sheets":["ReadMe","ChangeLog","Interpolate","BlendAirfoils","3DStall","TableExtrap","DynStall","Editor Format"],"not_rendered":{"charts":8,"images":8,"macros":1,"external_links":0,"defined_names":17,"comments":3,"pivot_tables":0},"unopened":[],"bounds":{"document_bytes":16777216,"sheet_cells":100000,"rows_first":2000,"rows_last":500,"rows_between":2000,"halvings":0,"cell_chars":16384,"cell_head_chars":4096},"cells_cut":0,"cells_raw":0,"read":"whole","date_system":"1900"}

{"sheet":"ReadMe","index":0,"n_rows":0,"n_cols":0,"rows_kept":0,"cut":false,"hidden":false,"merged":[]}

{"sheet":"ChangeLog","index":1,"n_rows":0,"n_cols":0,"rows_kept":0,"cut":false,"hidden":false,"merged":[]}

{"sheet":"Interpolate","index":2,"n_rows":189,"n_cols":5,"rows_kept":189,"cut":false,"hidden":false,"merged":[]}
["Generates an \"Interpolated Table\" from an \"Original Table\""]
["Generates new values of Y for new values of X, based upon an original X,Y table"]
[null,"Both tables must list X values in ascending order"]
[null,"The New X values must all lie within the range of the original X values"]
[]
[null,"Original Table",null,"Interpolated Table"]
[]
[null,"X Value","Y value","New X","New Y"]
[null,-181.99600000000001,-5.2556400000000003E-2,-180,-2.1338479679144238E-2]
[null,-179.75200000000001,-1.7459700000000002E-2,-178,3.1764061733883936E-2]
[null,-179.33,1.3635599999999999E-2,-176,6.2974188154897803E-2]
[null,-176.18100000000001,5.6557799999999998E-2,-174,0.11422078834951453]
[null,-175.303,8.7682599999999999E-2,-172,0.14193185978687625]
[null,-173.964,0.114954,-170,0.18060966169154227]
[null,-172.16300000000001,0.13837099999999999,-168,0.19301000000000001]
[null,-170.38,0.17732200000000001,-166,0.19253117740174669]
[null,-168.571,0.19297300000000001,-164,0.18784416179677274]
[null,-166.28700000000001,0.19312099999999999,-162,0.18072232210755021]
[null,-164.45500000000001,0.189356,-160,0.17022673234811164]
[null,-162.16200000000001,0.18173700000000001,-158,0.17035590585659552]
{"$rows_left_out":170}
{"sheet":"BlendAirfoils","index":3,"n_rows":35,"n_cols":12,"rows_kept":35,"cut":false,"hidden":false,"merged":[]}
["Airfoil property blending"]
["This worksheet calculates a new airfoil table that is a weighted average of two input tables"]
["The Blended Airfoil table will be created at the same angles of attack that you input for Airfoil A"]
[]
["Airfoil A",null,null,null,"Airfoil B",null,null,null,"Blended airfoil"]
["Weighting",0.5,null,null,"Weighting",{"$f":"1-B6","v":0.5}]
["Alpha (deg)","CL","CD","CM","Alpha (deg)","CL","CD","CM","Alpha (deg)","CL","CD","CM"]
[-3.04,-7.0999999999999994E-2,1.2200000000000001E-2,0,-3.04,-8.5199999999999984E-2,1.464E-2,0,-3.04,-7.8099999999999989E-2,1.3420000000000001E-2,0]
[-2.0299999999999998,4.3999999999999997E-2,1.06E-2,0,-2.0299999999999998,5.2799999999999993E-2,1.272E-2,0,-2.0299999999999998,4.8399999999999999E-2,1.166E-2,0]
[-1.01,0.14399999999999999,1.14E-2,0,-1.01,0.17279999999999998,1.3679999999999999E-2,0,-1.01,0.15839999999999999,1.2539999999999999E-2,0]
[0.01,0.24099999999999999,1.34E-2,0,0.01,0.28919999999999996,1.6080000000000001E-2,0,0.01,0.2651,1.474E-2,0]
[1.03,0.33800000000000002,1.3599999999999999E-2,0,1.03,0.40560000000000002,1.6319999999999998E-2,0,1.03,0.37180000000000002,1.4959999999999998E-2,0]
[2.0499999999999998,0.435,1.4E-2,0,2.0499999999999998,0.52200000000000002,1.6799999999999999E-2,0,2.0499999999999998,0.47850000000000004,1.54E-2,0]
[3.07,0.53500000000000003,1.47E-2,0,3.07,0.64200000000000002,1.7639999999999999E-2,0,3.07,0.58850000000000002,1.617E-2,0]
[4.09,0.63200000000000001,1.5599999999999999E-2,0,4.09,0.75839999999999996,1.8719999999999997E-2,0,4.09,0.69520000000000004,1.7159999999999998E-2,0]
[5.1100000000000003,0.72799999999999998,1.6199999999999999E-2,0,5.1100000000000003,0.87359999999999993,1.9439999999999999E-2,0,5.1100000000000003,0.80079999999999996,1.7819999999999999E-2,0]
[6.13,0.81299999999999994,1.7299999999999999E-2,0,6.13,0.97559999999999991,2.0759999999999997E-2,0,6.13,0.89429999999999987,1.9029999999999998E-2,0]
[7.14,0.88300000000000001,1.9099999999999999E-2,0,7.14,1.0595999999999999,2.2919999999999999E-2,0,7.14,0.97129999999999994,2.1010000000000001E-2,0]
[8.16,0.94599999999999995,2.1499999999999998E-2,0,8.16,1.1352,2.5799999999999997E-2,0,8.16,1.0406,2.3649999999999997E-2,0]
[9.17,1.0009999999999999,2.4799999999999999E-2,0,9.17,1.2011999999999998,2.9759999999999998E-2,0,9.17,1.1010999999999997,2.7279999999999999E-2,0]
{"$rows_left_out":16}
{"sheet":"3DStall","index":4,"n_rows":48,"n_cols":14,"rows_kept":48,"cut":false,"hidden":false,"merged":[]}
["Apply Selig Du correction per ASME paper, Reno, 1998, page 9.  Also include Eggars CD adjustment from ASME, 2003"]
["Enter values in red",null,null,null,null,null,null,null,null,"CL slope",{"$f":"SLOPE(I16:I52,H16:H52)","v":0.1113710266154178},"1/deg",{"$f":"K2*180/PI()","v":6.3810897851026009},"1/rad"]
["Rotor RPM",200,"RPM",null,"r/R",0.25,null,null,null,"intercept (y)",{"$f":"INTERCEPT(I16:I55,H16:H55)","v":9.6647113851773145E-2},"--"]
["Rotor R",2.4,"m",null,"chord",0.18,"m",null,null,"alpha0",{"$f":"-K3/K2","v":-0.86779404652083603},"deg",{"$f":"K4*PI()/180","v":-1.5145863340993432E-2},"rad"]
["Wind, V",10,"m/s"]
["Constants:",null,null,null,"For CL Slope Calc:",null,null,null,null,null,"c/r",0.3]
["a",1,null,null,"Min. Alpha",-5,null,null,null,null,"lambda",0.98077940391934171]
["b",1,null,null,"Max Alpha",5,null,null,null,null,"d/lam*R/r",4.0783890689541398]
["d",1,null,null,null,null,null,null,null,null,"factor fL",0.42830291734505765]
[null,null,null,null,"Alpha End",30,"End of full correction at this angle of attack"]
[]
[]
[null,null,null,null,null,null,null,"Used for CL slope calc. only"]
["2-D airfoil data:",null,null,"3-D results:",null,null,null,"Do not change"]
["Alpha","CL","CD","Alpha","CL-3D","CD-3D",null,"Alpha","CL"]
[-9,-0.80227586206896551,2.7351995685005397E-2,-9,-0.84656934947748963,3.9921511270182335E-2,null,-4,-0.31312264150943397]
[-8,-0.72085714285714275,2.503487348734873E-2,-8,-0.75232196962349118,3.3373373690261304E-2,null,-3,-0.22029411764705883]
[-7,-0.6113333333333334,2.399733796296296E-2,-7,-0.64200699163037622,3.1555796058905843E-2,null,-2,-0.1334950495049505]
[-6,-0.50618867924528299,2.2935575942915395E-2,-6,-0.53419556402437729,2.9320575178709337E-2,null,-1,-5.969230769230769E-2]
[-5,-0.4077216494845361,2.2229411764705883E-2,-5,-0.4302017147653634,2.6943259453927636E-2,null,0,3.5666666666666666E-2]
{"$rows_left_out":29}
{"sheet":"TableExtrap","index":5,"n_rows":214,"n_cols":11,"rows_kept":214,"cut":false,"hidden":false,"merged":[]}
["This worksheet extends the airfoil tables to large angles of attack using the Viterna method"]
["Enter values in red.  All others are calculated"]
[]
["Maximum Drag Coeff:"]
["Aspect ratio",10,{"$f":"1.11+0.018*B5","v":1.29},"CDmax estimated from Aspect ratio"]
["Max CD",1.8,"<--This value is the one we'll use.  The Aspect Ratio value "]
[null,null,"is provided for reference only"]
[]
[]
[null,null,null,null,null,null,null,null,"CM at zero lift:",-0.1633]
["Get CD from flat-plate theory for abs(angles) >",20,"deg"]
[]
[null,"Input table:",null,null,null,null,null,"Output table:"]
[null,"Alpha (deg)","CL","CD","CM (not req'd.)",null,null,"Alpha (deg)","CL","CD","CM"]
["200 rows max.",-10,-0.64,1.44E-2,-0.14460000000000001,null,null,-180,0,0.28233787457504655,0]
[2,-8,-0.48,1.24E-2,-0.1545,null,null,-170,0.20124999999999998,0.33232516914317667,0.4]
[3,-6,0.06,9.1999999999999998E-3,-0.16439999999999999,null,null,-160,0.40249999999999997,0.47587081849946833,0.46631110677265325]
[4,-5,0.17,8.2000000000000007E-3,-0.1673,null,null,-150,0.6037499999999999,0.6945117718324948,0.55093687558948801]
[5,-4,0.28000000000000003,6.7000000000000002E-3,-0.17019999999999999,null,null,-140,0.80499999999999994,0.96,0.63769199037787805]
[6,-3,0.39,6.7999999999999996E-3,-0.17349999999999999,null,null,-130,0.72947352559748857,1.2377666474223095,0.65178230622639954]
{"$rows_left_out":195}
{"sheet":"DynStall","index":6,"n_rows":212,"n_cols":21,"rows_kept":212,"cut":false,"hidden":false,"merged":[]}
["This worksheet calculates dynamic stall parameters"]
["Enter values in red.  All others are calculated"]
[]
["AoA range for CN slope calc:"]
["Min. Alpha",-4]
["Max. Alpha",5]
[]
[]
[null,null,null,null,null,null,null,null,null,11,"Stall angle (deg)",null,null,null,null,null,null,null,null,"CNStall plot"]
[null,"Input airfoil table:",null,null,null,null,null,null,null,{"$f":"-INTERCEPT(U19:U58,T19:T58)/J11*180/PI()","v":-0.36887493755927425},"Zero Cn angle of attack (deg)",null,null,null,null,null,null,null,null,{"$f":"J10","v":-0.36887493755927425},0]
[null,null,null,null,null,null,null,null,null,{"$f":"SLOPE(U19:U58,T19:T58)*180/PI()","v":6.9837640439588196},"Cn slope for zero lift (dimensionless)",null,null,null,null,null,null,null,null,{"$f":"J9","v":11},{"$f":"J12","v":1.3857484911443123}]
[null,"Alpha (deg)","CL","CD","CM (not req'd.)",null,"CN","CT",null,{"$f":"J11*PI()/180*(J9-J10)","v":1.3857484911443123},"Cn extrapolated to value at positive stall angle of attack"]
["200 rows max.",-10.1,-0.63,3.9E-2,-4.4000000000000003E-3,null,-0.62707630570148254,7.2085413418948849E-2,null,-0.8,"Cn at stall value for negative angle of attack"]
[2,-8.1999999999999993,-0.56000000000000005,2.3300000000000001E-2,-5.1000000000000004E-3,null,-0.55759794346370029,5.6810416694935036E-2,null,2,"Angle of attack for minimum CD (deg)"]
[3,-6.1,-0.64,1.3100000000000001E-2,1.8E-3,null,-0.63776834357975565,5.4983178587044268E-2,null,1.1599999999999999E-2,"Minimum CD value                                                                "]
[4,-4.0999999999999996,-0.42,1.34E-2,-2.1600000000000001E-2,null,-0.41988319458505446,1.6663220128453435E-2]
[5,-2.1,-0.21,1.1900000000000001E-2,-2.8199999999999999E-2,null,-0.21029502282712581,-4.1968290575891921E-3,null,null,null,null,null,null,null,null,null,null,null,"CN slope work space.  Do not change"]
[6,0.1,0.05,1.2200000000000001E-2,-3.4599999999999999E-2,null,5.0021216851728348E-2,-1.2112715000047194E-2,null,null,null,null,null,null,null,null,null,null,null,"Alpha","CN"]
[7,2,0.3,1.1599999999999999E-2,-4.0500000000000001E-2,null,0.30022208226747771,-1.1230845826712198E-3,null,null,null,null,null,null,null,null,null,null,null,-2.1,-0.21029502282712581]
[8,4.0999999999999996,0.54,1.44E-2,-4.5499999999999999E-2,null,0.53964758598110041,2.4245472665444804E-2,null,null,null,null,null,null,null,null,null,null,null,0.1,5.0021216851728348E-2]
{"$rows_left_out":193}
{"sheet":"Editor Format","index":7,"n_rows":210,"n_cols":11,"rows_kept":210,"cut":false,"hidden":false,"merged":[]}
[null,null,null,null,null,null,1,"Flag =1 if CM values are used (value normally set by TableExtrap worksheet)"]
[]
[{"$f":"REPT(\" \",7-LEN(TEXT(DynStall!J9,H$10)))&TEXT(DynStall!J9,H$10)&\"     Stall angle (deg)\"","v":"  11.00     Stall angle (deg)"}]
[{"$f":"REPT(\" \",9-LEN(TEXT(DynStall!J10,J$10)))&TEXT(DynStall!J10,J$10)&\"   Zero Cn angle of attack (deg)\"","v":"  -0.3689   Zero Cn angle of attack (deg)"}]
[{"$f":"REPT(\" \",9-LEN(TEXT(DynStall!J11,J$10)))&TEXT(DynStall!J11,J$10)&\"   Cn slope for zero lift (dimensionless)\"","v":"   6.9838   Cn slope for zero lift (dimensionless)"}]
[{"$f":"REPT(\" \",9-LEN(TEXT(DynStall!J12,J$10)))&TEXT(DynStall!J12,J$10)&\"   Cn extrapolated to value at positive stall angle of attack\"","v":"   1.3857   Cn extrapolated to value at positive stall angle of attack"}]
[{"$f":"REPT(\" \",9-LEN(TEXT(DynStall!J13,J$10)))&TEXT(DynStall!J13,J$10)&\"   Cn at stall value for negative angle of attack\"","v":"  -0.8000   Cn at stall value for negative angle of attack"}]
[{"$f":"REPT(\" \",7-LEN(TEXT(DynStall!J14,H$10)))&TEXT(DynStall!J14,H$10)&\"     Angle of attack for minimum CD (deg)\"","v":"   2.00     Angle of attack for minimum CD (deg)"}]
[{"$f":"REPT(\" \",9-LEN(TEXT(DynStall!J15,J$10)))&TEXT(DynStall!J15,J$10)&\"   Minimum CD value\"","v":"   0.0116   Minimum CD value"},null,null,null,null,null,null,"Alpha Fmt","Cl Fmt","Cd Fmt","Cm Fmt"]
[{"$f":"IF(TableExtrap!J15=0,\" \",REPT(\" \",$H$11-LEN(TEXT(TableExtrap!H15,H$10)))&TEXT(TableExtrap!H15,H$10)&REPT(\" \",$I$11-LEN(TEXT(TableExtrap!I15,I$10)))&TEXT(TableExtrap!I15,I$10)&REPT(\" \",$J$11-LEN(TEXT(TableExtrap!J15,J$10)))&TEXT(TableExtrap!J15,J$10)&IF($G$1=1,REPT(\" \",$K$11-LEN(TEXT(TableExtrap!K15,K$10)))&TEXT(TableExtrap!K15,K$10),\"\"))","v":"-180.00    0.000   0.2823   0.0000"},null,null,null,null,null,"Format","#0.00","#0.000","#0.0000","#0.0000"]
[{"$f":"IF(TableExtrap!J16=0,\" \",REPT(\" \",$H$11-LEN(TEXT(TableExtrap!H16,H$10)))&TEXT(TableExtrap!H16,H$10)&REPT(\" \",$I$11-LEN(TEXT(TableExtrap!I16,I$10)))&TEXT(TableExtrap!I16,I$10)&REPT(\" \",$J$11-LEN(TEXT(TableExtrap!J16,J$10)))&TEXT(TableExtrap!J16,J$10)&IF($G$1=1,REPT(\" \",$K$11-LEN(TEXT(TableExtrap!K16,K$10)))&TEXT(TableExtrap!K16,K$10),\"\"))","v":"-170.00    0.201   0.3323   0.4000"},null,null,null,null,null,"Width",7,9,9,9]
[{"$f":"IF(TableExtrap!J17=0,\" \",REPT(\" \",$H$11-LEN(TEXT(TableExtrap!H17,H$10)))&TEXT(TableExtrap!H17,H$10)&REPT(\" \",$I$11-LEN(TEXT(TableExtrap!I17,I$10)))&TEXT(TableExtrap!I17,I$10)&REPT(\" \",$J$11-LEN(TEXT(TableExtrap!J17,J$10)))&TEXT(TableExtrap!J17,J$10)&IF($G$1=1,REPT(\" \",$K$11-LEN(TEXT(TableExtrap!K17,K$10)))&TEXT(TableExtrap!K17,K$10),\"\"))","v":"-160.00    0.403   0.4759   0.4663"}]
[{"$f":"IF(TableExtrap!J18=0,\" \",REPT(\" \",$H$11-LEN(TEXT(TableExtrap!H18,H$10)))&TEXT(TableExtrap!H18,H$10)&REPT(\" \",$I$11-LEN(TEXT(TableExtrap!I18,I$10)))&TEXT(TableExtrap!I18,I$10)&REPT(\" \",$J$11-LEN(TEXT(TableExtrap!J18,J$10)))&TEXT(TableExtrap!J18,J$10)&IF($G$1=1,REPT(\" \",$K$11-LEN(TEXT(TableExtrap!K18,K$10)))&TEXT(TableExtrap!K18,K$10),\"\"))","v":"-150.00    0.604   0.6945   0.5509"}]
[{"$f":"IF(TableExtrap!J19=0,\" \",REPT(\" \",$H$11-LEN(TEXT(TableExtrap!H19,H$10)))&TEXT(TableExtrap!H19,H$10)&REPT(\" \",$I$11-LEN(TEXT(TableExtrap!I19,I$10)))&TEXT(TableExtrap!I19,I$10)&REPT(\" \",$J$11-LEN(TEXT(TableExtrap!J19,J$10)))&TEXT(TableExtrap!J19,J$10)&IF($G$1=1,REPT(\" \",$K$11-LEN(TEXT(TableExtrap!K19,K$10)))&TEXT(TableExtrap!K19,K$10),\"\"))","v":"-140.00    0.805   0.9600   0.6377"}]
[{"$f":"IF(TableExtrap!J20=0,\" \",REPT(\" \",$H$11-LEN(TEXT(TableExtrap!H20,H$10)))&TEXT(TableExtrap!H20,H$10)&REPT(\" \",$I$11-LEN(TEXT(TableExtrap!I20,I$10)))&TEXT(TableExtrap!I20,I$10)&REPT(\" \",$J$11-LEN(TEXT(TableExtrap!J20,J$10)))&TEXT(TableExtrap!J20,J$10)&IF($G$1=1,REPT(\" \",$K$11-LEN(TEXT(TableExtrap!K20,K$10)))&TEXT(TableExtrap!K20,K$10),\"\"))","v":"-130.00    0.729   1.2378   0.6518"}]
[{"$f":"IF(TableExtrap!J21=0,\" \",REPT(\" \",$H$11-LEN(TEXT(TableExtrap!H21,H$10)))&TEXT(TableExtrap!H21,H$10)&REPT(\" \",$I$11-LEN(TEXT(TableExtrap!I21,I$10)))&TEXT(TableExtrap!I21,I$10)&REPT(\" \",$J$11-LEN(TEXT(TableExtrap!J21,J$10)))&TEXT(TableExtrap!J21,J$10)&IF($G$1=1,REPT(\" \",$K$11-LEN(TEXT(TableExtrap!K21,K$10)))&TEXT(TableExtrap!K21,K$10),\"\"))","v":"-120.00    0.604   1.4912   0.6655"}]
[{"$f":"IF(TableExtrap!J22=0,\" \",REPT(\" \",$H$11-LEN(TEXT(TableExtrap!H22,H$10)))&TEXT(TableExtrap!H22,H$10)&REPT(\" \",$I$11-LEN(TEXT(TableExtrap!I22,I$10)))&TEXT(TableExtrap!I22,I$10)&REPT(\" \",$J$11-LEN(TEXT(TableExtrap!J22,J$10)))&TEXT(TableExtrap!J22,J$10)&IF($G$1=1,REPT(\" \",$K$11-LEN(TEXT(TableExtrap!K22,K$10)))&TEXT(TableExtrap!K22,K$10),\"\"))","v":"-110.00    0.430   1.6860   0.6673"}]
[{"$f":"IF(TableExtrap!J23=0,\" \",REPT(\" \",$H$11-LEN(TEXT(TableExtrap!H23,H$10)))&TEXT(TableExtrap!H23,H$10)&REPT(\" \",$I$11-LEN(TEXT(TableExtrap!I23,I$10)))&TEXT(TableExtrap!I23,I$10)&REPT(\" \",$J$11-LEN(TEXT(TableExtrap!J23,J$10)))&TEXT(TableExtrap!J23,J$10)&IF($G$1=1,REPT(\" \",$K$11-LEN(TEXT(TableExtrap!K23,K$10)))&TEXT(TableExtrap!K23,K$10),\"\"))","v":"-100.00    0.222   1.7948   0.6507"}]
[{"$f":"IF(TableExtrap!J24=0,\" \",REPT(\" \",$H$11-LEN(TEXT(TableExtrap!H24,H$10)))&TEXT(TableExtrap!H24,H$10)&REPT(\" \",$I$11-LEN(TEXT(TableExtrap!I24,I$10)))&TEXT(TableExtrap!I24,I$10)&REPT(\" \",$J$11-LEN(TEXT(TableExtrap!J24,J$10)))&TEXT(TableExtrap!J24,J$10)&IF($G$1=1,REPT(\" \",$K$11-LEN(TEXT(TableExtrap!K24,K$10)))&TEXT(TableExtrap!K24,K$10),\"\"))","v":" -90.00    0.000   1.8000   0.6133"}]
[{"$f":"IF(TableExtrap!J25=0,\" \",REPT(\" \",$H$11-LEN(TEXT(TableExtrap!H25,H$10)))&TEXT(TableExtrap!H25,H$10)&REPT(\" \",$I$11-LEN(TEXT(TableExtrap!I25,I$10)))&TEXT(TableExtrap!I25,I$10)&REPT(\" \",$J$11-LEN(TEXT(TableExtrap!J25,J$10)))&TEXT(TableExtrap!J25,J$10)&IF($G$1=1,REPT(\" \",$K$11-LEN(TEXT(TableExtrap!K25,K$10)))&TEXT(TableExtrap!K25,K$10),\"\"))","v":" -80.00   -0.222   1.7948   0.5789"}]
{"$rows_left_out":190}